{"text_format":"1","workbook":"xlsx","n_sheets":4,"sheets":["使い方","2021講座イベント情報","個別データ","選択リスト"],"not_rendered":{"charts":0,"images":4,"macros":1,"external_links":2,"defined_names":16,"comments":0,"pivot_tables":0},"unopened":[],"bounds":{"document_bytes":16777216,"sheet_cells":100000,"rows_first":2000,"rows_last":500,"rows_between":2000,"halvings":0,"cell_chars":16384,"cell_head_chars":4096},"cells_cut":0,"cells_raw":0,"read":"whole","date_system":"1900"}

{"sheet":"使い方","index":0,"n_rows":23,"n_cols":6,"rows_kept":23,"cut":false,"hidden":false,"merged":[[1,0,1,4],[22,0,22,4],[0,0,0,3],[1,5,1,8],[16,5,16,8],[0,5,0,7]]}
["検索のかけ方",null,null,null,null,"個別データの表示のさせ方"]
["１　各列毎に検索ができます。項目の行（緑の行）の右下の▼をクリックして、検索したいものを選びます。",null,null,null,null,"１　個別表示させたいデータの番号を選んで、最初の行にあるボタンをクリックします。"]
[]
[]
[]
[]
[]
[]
[]
[]
[]
[]
[]
[]
[]
[]
[null,null,null,null,null,"２　個別データが表示されます。戻る場合には、元のワークシートを選びます。"]
[]
[]
[]
[]
[]
["２　選んだ項目に適合するﾃﾞｰﾀのみを表示します。元に戻すには、（すべて）をクリックします。"]

{"sheet":"2021講座イベント情報","index":1,"n_rows":641,"n_cols":33,"rows_kept":641,"cut":false,"hidden":false,"merged":[[170,12,170,13],[174,12,174,13],[179,24,192,24],[1,26,1,27],[2,26,3,26],[8,26,10,26],[12,26,17,26],[19,26,21,26]]}
["整理番号１","種別２","対象３","事業名４","分類５","開催場所市町村６","事業内容７",null,"開始年８","月９","日10","終了年11","月12","日13","定員14","費用15","費用金額16","開催場所名称17","開催場所住所18","問い合わせ先名称19","問い合わせ先電話番号20","問い合わせ先FAX番号21","問い合わせ先\nE-MAIL22","関連サイトＵＲＬ23","備考24"]
[1,"新規","市町村向け","図書バッグ作り講座","現代的課題 - 子育て・家庭教育","盛岡市","児童保護者を対象とした，図書室利用の際に役立つエコバッグを児童書のデザインを参考にしながら制作。",null,2022,3,null,2022,3,null,null,"無料",null,"盛岡市中央公民館","盛岡市愛宕町14-1","盛岡市中央公民館","019-654-5366","019-653-3505","chuo.ph@city.morioka.iwate.jp","http://www.city.morioka.iwate.jp/kurashi/kokyoshisetsu/kominkan/chuo/index.html","先着順",null,"【選択用リスト】"]
[2,"継続","市町村向け","読書指導員による読み聞かせと絵本の選び方","現代的課題 - 子育て・家庭教育","盛岡市","実際に絵本を紹介しながら，読み聞かせなどの経験豊かな読書指導員から発達段階に合わせた絵本の選び方を学ぶ。【SDGs目標５】",null,2022,2,null,2022,3,null,null,"無料",null,"盛岡市中央公民館","盛岡市愛宕町14-1","盛岡市中央公民館","019-654-5366","019-653-3505","chuo.ph@city.morioka.iwate.jp","http://www.city.morioka.iwate.jp/kurashi/kokyoshisetsu/kominkan/chuo/index.html","先着順",null,"該当あり",null,null,"開催場所\n市町村","盛岡市",null,"現代的課題 - 子育て・家庭教育"]
[3,"継続","市町村向け","わくわく盛岡チャレンジクラブ","現代的課題 - 子育て・家庭教育","盛岡市","子どもたちにさまざまな体験をしてもらい，その経験を通じて，子どもたちの社会への関心と順応度とを高める場とする。",null,2021,7,null,2021,11,null,null,"無料",null,"盛岡市中央公民館","盛岡市愛宕町14-1","盛岡市中央公民館","019-654-5366","019-653-3505","chuo.ph@city.morioka.iwate.jp","http://www.city.morioka.iwate.jp/kurashi/kokyoshisetsu/kominkan/chuo/index.html",null,null,null,"○",null,null,"八幡平市",null,"現代的課題 - 環境・自然保護"]
[4,"継続","市町村向け","高校生のための短歌ゼミ～めざせ短歌甲子園～","教養・文化 - 文学","盛岡市","市内および近郊の高校生を対象として，啄木ゆかりの地で行われる短歌甲子園の開催地である盛岡として，青少年の文学への関心を高めるきっかけづくりを行う。",null,2022,2,null,2022,2,null,null,"無料",null,"盛岡市中央公民館","盛岡市愛宕町14-1","盛岡市中央公民館","019-654-5366","019-653-3505","chuo.ph@city.morioka.iwate.jp","http://www.city.morioka.iwate.jp/kurashi/kokyoshisetsu/kominkan/chuo/index.html",null,null,null,null,null,null,"滝沢市",null,"現代的課題 - 男女共同参画"]
[5,"新規","市町村向け","夏休み・冬休み　学びっ子フィールド","現代的課題 - 子育て・家庭教育","盛岡市","コロナ禍の中で図書館などでの学習スペースの座席数が削減されている昨今，お盆期間などの時期に生徒の長期学習空間を提供し，学校教育の後方支援の場を設ける。",null,2021,8,null,2022,1,null,null,"無料",null,"盛岡市中央公民館","盛岡市愛宕町14-1","盛岡市中央公民館","019-654-5366","019-653-3505","chuo.ph@city.morioka.iwate.jp","http://www.city.morioka.iwate.jp/kurashi/kokyoshisetsu/kominkan/chuo/index.html",null,null,null,null,null,null,"雫石町",null,"現代的課題 - 高齢化・介護・福祉"]
[6,"新規","市町村向け","冬休みお子様昔話映画観賞会","現代的課題 - 子育て・家庭教育","盛岡市","中央地域視聴覚ライブラリーで所蔵する昔話を上映し，子供たちに古典の面白さを感じてもらう場を設ける。",null,2022,1,null,2022,1,null,null,"無料",null,"盛岡市中央公民館","盛岡市愛宕町14-1","盛岡市中央公民館","019-654-5366","019-653-3505","chuo.ph@city.morioka.iwate.jp","http://www.city.morioka.iwate.jp/kurashi/kokyoshisetsu/kominkan/chuo/index.html",null,null,"更新種別","新規",null,null,"葛巻町",null,"現代的課題 - ＮＰＯ・ボランティア"]
[7,"新規","市町村向け","南部家別邸物語","学術一般 - 歴史・地理・民俗","盛岡市","和風建築である別館の風情に触れながら，中央公民館の歩みと連携する南部家の歴史を学ぶ。",null,2021,12,null,2021,12,null,null,"有料","500円","盛岡市中央公民館","盛岡市愛宕町14-1","盛岡市中央公民館","019-654-5366","019-653-3505","chuo.ph@city.morioka.iwate.jp","http://www.city.morioka.iwate.jp/kurashi/kokyoshisetsu/kominkan/chuo/index.html",null,null,null,null,null,null,"岩手町",null,"現代的課題 - まちづくり"]
[8,"継続","市町村向け","少年指導員養成講座","現代的課題 - ＮＰＯ・ボランティア","盛岡市","子ども会等の青少年活動を促進するため，活動に必要な知識・技術の習得を通して，地域に定着した指導者を養成する。",null,2021,7,7,2021,9,25,null,"無料",null,"盛岡市中央公民館","盛岡市愛宕町14-1","盛岡市中央公民館","019-654-5366","019-653-3505","chuo.ph@city.morioka.iwate.jp","http://www.city.morioka.iwate.jp/kurashi/kokyoshisetsu/kominkan/chuo/index.html",null,null,"県民・市町村向け","県民向け",null,null,"紫波町",null,"現代的課題 - 語学・国際理解"]
[9,"継続","市町村向け","少年指導員研修講座","現代的課題 - ＮＰＯ・ボランティア","盛岡市","地域社会教育促進事業と共同で地元の資源を学び，少年を対象としたボランティア指導者として求められる知識や技術向上を図るための研修会を行う。",null,2021,7,null,2021,8,null,null,"無料",null,"盛岡市中央公民館","盛岡市愛宕町14-1","盛岡市中央公民館","019-654-5366","019-653-3505","chuo.ph@city.morioka.iwate.jp","http://www.city.morioka.iwate.jp/kurashi/kokyoshisetsu/kominkan/chuo/index.html",null,null,null,"広域（近隣市町村含む）向け",null,null,"矢巾町",null,"学術一般 - 歴史・地理・民俗"]
[10,"継続","市町村向け","サークル支援講座","教養・文化 - その他","盛岡市","会員数の減少等により運営に支障をきたしている利用サークルに対し，会員募集のための体験講座の支援を行い，サークル活動の活性化を図る。",null,2021,10,null,2021,12,null,null,"有料","500円","盛岡市中央公民館","盛岡市愛宕町14-1","盛岡市中央公民館","019-654-5366","019-653-3505","chuo.ph@city.morioka.iwate.jp","http://www.city.morioka.iwate.jp/kurashi/kokyoshisetsu/kominkan/chuo/index.html",null,null,null,"市町村向け",null,null,"花巻市",null,"学術一般 - 心理・哲学・法律"]
[11,"継続","市町村向け","よくおでんした盛岡へ","学術一般 - 歴史・地理・民俗","盛岡市","盛岡に転入してきた方を対象に，盛岡の歴史や文化に触れる機会の場を設ける。",null,2021,5,11,2021,6,8,null,"有料","500円","盛岡市中央公民館","盛岡市愛宕町14-1","盛岡市中央公民館","019-654-5366","019-653-3505","chuo.ph@city.morioka.iwate.jp","http://www.city.morioka.iwate.jp/kurashi/kokyoshisetsu/kominkan/chuo/index.html",null,null,null,null,null,null,"北上市",null,"学術一般 - 教育"]
[12,"継続","市町村向け","盛岡わけもんカレッジ","教養・文化 - その他","盛岡市","公民館を利用する機会の少ない青年層を対象に，地元で活躍する方々から体験を聞き学び，参加した青年同士の交流を進めながら，盛岡を知り，見つめ直すきっかけとする。",null,2021,7,null,2021,10,null,null,"有料","500円","盛岡市中央公民館","盛岡市愛宕町14-1","盛岡市中央公民館","019-654-5366","019-653-3505","chuo.ph@city.morioka.iwate.jp","http://www.city.morioka.iwate.jp/kurashi/kokyoshisetsu/kominkan/chuo/index.html",null,null,null,null,null,null,"西和賀町",null,"学術一般 - 物理・天文・地学"]
[13,"継続","市町村向け","もりおかミドルアカデミー","教養・文化 - その他","盛岡市","セカンドライフが気になりはじめた世代を対象に，各界で活躍する同年代の方々と情報交換しながら楽しく学ぶ。",null,2021,7,null,2021,10,null,null,"有料","500円","盛岡市中央公民館","盛岡市愛宕町14-1","盛岡市中央公民館","019-654-5366","019-653-3505","chuo.ph@city.morioka.iwate.jp","http://www.city.morioka.iwate.jp/kurashi/kokyoshisetsu/kominkan/chuo/index.html",null,null,null,null,null,null,"奥州市",null,"学術一般 - 自然・動植物"]
[14,"継続","市町村向け","古典文学入門講座","教養・文化 - 文学","盛岡市","日本文学の原点となる平安期文学の成立過程を学ぶ。",null,2021,11,null,2021,12,null,null,"有料","1,000円","盛岡市中央公民館","盛岡市愛宕町14-1","盛岡市中央公民館","019-654-5366","019-653-3505","chuo.ph@city.morioka.iwate.jp","http://www.city.morioka.iwate.jp/kurashi/kokyoshisetsu/kominkan/chuo/index.html",null,null,null,null,null,null,"金ヶ崎町",null,"学術一般 - 医学・薬学"]
[15,"継続","市町村向け","環境講座　自然の不思議","現代的課題 - 環境・自然保護","盛岡市","自然環境の保護が求められる中，生き物の姿を通して身近な環境問題について学習する。",null,2022,2,null,2022,2,null,null,"無料",null,"盛岡市中央公民館","盛岡市愛宕町14-1","盛岡市中央公民館","019-654-5366","019-653-3505","chuo.ph@city.morioka.iwate.jp","http://www.city.morioka.iwate.jp/kurashi/kokyoshisetsu/kominkan/chuo/index.html",null,null,null,null,null,null,"平泉町",null,"学術一般 - その他"]
[16,"継続","市町村向け","防災講座（パネルディスカッション）\nあの3.11から10年～その時テレビは，ラジオはどう動いたか～","学術一般 - その他","盛岡市","10年前の３月11日，報道に携わった関係者はいかに伝えようと奮闘したのかを複数の関係者によるシンポジウム形式で当時を紹介してもらい，視聴者としての防災を意識してもらう場を設ける。",null,2022,3,null,2022,3,null,null,"無料",null,"盛岡市中央公民館","盛岡市愛宕町14-1","盛岡市中央公民館","019-654-5366","019-653-3505","chuo.ph@city.morioka.iwate.jp","http://www.city.morioka.iwate.jp/kurashi/kokyoshisetsu/kominkan/chuo/index.html",null,null,null,null,null,null,"一関市",null,"教養・文化 - 美術・工芸"]
[17,"継続","市町村向け","復興応援　バスツアー","学術一般 - その他","盛岡市","陸前高田の東日本大震災津波伝承館を見学して，復興の歩みを知ることで，これからの防災対応について学習する。",null,2021,12,null,2021,12,null,null,"無料",null,"盛岡市中央公民館","盛岡市愛宕町14-1","盛岡市中央公民館","019-654-5366","019-653-3505","chuo.ph@city.morioka.iwate.jp","http://www.city.morioka.iwate.jp/kurashi/kokyoshisetsu/kominkan/chuo/index.html",null,null,null,null,null,null,"大船渡市",null,"教養・文化 - 音楽"]
[18,"継続","市町村向け","ボランティア講座\n聴覚障害とコミュニケーション","現代的課題 - ＮＰＯ・ボランティア","盛岡市","令和２年に実施した手話講座を継続して行い，聴覚障がい者への理解を深める場を設ける。",null,2021,11,null,2022,2,null,null,"無料",null,"盛岡市中央公民館","盛岡市愛宕町14-1","盛岡市中央公民館","019-654-5366","019-653-3505","chuo.ph@city.morioka.iwate.jp","http://www.city.morioka.iwate.jp/kurashi/kokyoshisetsu/kominkan/chuo/index.html",null,null,null,null,null,null,"陸前高田市",null,"教養・文化 - 文学"]
[19,"新規","市町村向け","目からウロコ～盛岡の先人こぼればなし～先人同士の意外な関係","学術一般 - 歴史・地理・民俗","盛岡市","盛岡の先人たちの隠れた秘話や思わぬエピソードに触れ，人物を身近に感じてもらい，それぞれの生きた時代背景と生涯を学ぶ。",null,2021,10,null,2021,10,null,null,"無料",null,"盛岡市中央公民館","盛岡市愛宕町14-1","盛岡市中央公民館","019-654-5366","019-653-3505","chuo.ph@city.morioka.iwate.jp","http://www.city.morioka.iwate.jp/kurashi/kokyoshisetsu/kominkan/chuo/index.html",null,null,null,null,null,null,"住田町",null,"教養・文化 - 舞踏・演劇"]
[20,"新規","市町村向け","旧街道を歩こう！　","学術一般 - 歴史・地理・民俗","盛岡市","身近にある旧街道を散策し，昔のゆかりの風景を見つけながら当時の面影を想起してもらうことで，地元の魅力の再発見につなげる。",null,2021,11,null,2021,11,null,null,"有料","500円","盛岡市中央公民館","盛岡市愛宕町14-1","盛岡市中央公民館","019-654-5366","019-653-3505","chuo.ph@city.morioka.iwate.jp","http://www.city.morioka.iwate.jp/kurashi/kokyoshisetsu/kominkan/chuo/index.html",null,null,null,null,null,null,"遠野市",null,"教養・文化 - 郷土芸能"]
[21,"新規","市町村向け","英語と英米文化の教養講座","現代的課題 - 語学・国際理解","盛岡市","英語を通じて英語圏文化を学ぶことでカナダビクトリア市との交流促進のきっかけとなることやオリンピックホストタウンとしてのボランティア活動に携わる動機づけにつながる機会を設ける。【SDGs目標17】",null,2022,1,null,2022,2,null,null,"有料","1,000円","盛岡市中央公民館","盛岡市愛宕町14-1","盛岡市中央公民館","019-654-5366","019-653-3505","chuo.ph@city.morioka.iwate.jp","http://www.city.morioka.iwate.jp/kurashi/kokyoshisetsu/kominkan/chuo/index.html",null,null,null,null,null,null,"釜石市",null,"教養・文化 - 料理・お茶・お花・書道"]
[22,"新規","市町村向け","はじめての家庭菜園＆四季の寄せ植えと花のお話","ビジネスライフ - 農林水産","盛岡市","家庭菜園を学び，身近な地球環境について学習する場とする。",null,2021,7,null,2022,3,null,null,"有料","500円（材料費は別途）","盛岡市中央公民館","盛岡市愛宕町14-1","盛岡市中央公民館","019-654-5366","019-653-3505","chuo.ph@city.morioka.iwate.jp","http://www.city.morioka.iwate.jp/kurashi/kokyoshisetsu/kominkan/chuo/index.html",null,null,null,null,null,null,"大槌町",null,"教養・文化 - その他"]
[23,"新規","市町村向け","盛岡のおさけを学ぶ～大人のたしなみ「SAKE」講座～","教養・文化 - その他","盛岡市","南部杜氏ゆかりの地として，江戸時代からの歴史を学びながら，地元で根付いている｢醸造｣を見学して酒どころ盛岡の魅力に触れる。",null,2021,12,null,2021,12,null,null,"有料","500円（教材費・保険料は別途）","盛岡市中央公民館","盛岡市愛宕町14-1","盛岡市中央公民館","019-654-5366","019-653-3505","chuo.ph@city.morioka.iwate.jp","http://www.city.morioka.iwate.jp/kurashi/kokyoshisetsu/kominkan/chuo/index.html",null,null,null,null,null,null,"宮古市",null,"スポーツ・健康 - マラソン・陸上"]
[24,"新規","市町村向け","冬季オリンピック種目を体験し，もりおか　冬のスポーツを楽しもう","スポーツ・健康 - その他","盛岡市","2022年北京オリンピックの応援と，コロナ禍で在宅勤務増加に伴う運動不足解消を目指し，カーリングなどの冬のスポーツを体験する。【SDGs目標３】",null,2022,2,null,2022,2,null,null,"有料","500円","盛岡市アイスリンク","盛岡市本宮五丁目3-3","盛岡市中央公民館","019-654-5366","019-653-3505","chuo.ph@city.morioka.iwate.jp","http://www.city.morioka.iwate.jp/kurashi/kokyoshisetsu/kominkan/chuo/index.html",null,null,null,null,null,null,"山田町",null,"スポーツ・健康 - 球技"]
[25,"新規","市町村向け","こころとからだの癒し講座","スポーツ・健康 - 健康・予防","盛岡市","コロナ禍で巣ごもり生活を余儀なくされている昨今，ストレス解消のためのメンタルトレーニングと軽いストレッチ体操を体験し，健康維持に努める場を設ける。【SDGs目標３】",null,2021,9,null,2021,9,null,null,"有料","500円（教材費・保険料は別途）","盛岡市中央公民館","盛岡市愛宕町14-1","盛岡市中央公民館","019-654-5366","019-653-3505","chuo.ph@city.morioka.iwate.jp","http://www.city.morioka.iwate.jp/kurashi/kokyoshisetsu/kominkan/chuo/index.html",null,null,null,null,null,null,"岩泉町",null,"スポーツ・健康 - 武道"]
[26,"新規","市町村向け","地域のための会計講座（基礎編・決算編）","教養・文化 - その他","盛岡市","地域会計の重要性，会計年度の流れ，仕分け，記帳など経理事務の基礎を学び地域共同体を活性化を支援する場を設ける。【SDGs目標11】",null,2021,10,null,2022,2,null,null,"無料",null,"盛岡市中央公民館","盛岡市愛宕町14-1","盛岡市中央公民館","019-654-5366","019-653-3505","chuo.ph@city.morioka.iwate.jp","http://www.city.morioka.iwate.jp/kurashi/kokyoshisetsu/kominkan/chuo/index.html",null,null,null,null,null,null,"田野畑村",null,"スポーツ・健康 - 水泳"]
[27,"新規","市町村向け","公民館職員がおもてなす公民館フル活用講座：盛岡市中央公民館ってこんなところ！","教養・文化 - その他","盛岡市","企画展示室の工事を終えて７月１日にグランドオープンを迎えるにあたり，施設の内覧を含めた利用案内説明会を行う。",null,2021,7,null,2021,7,null,null,"無料",null,"盛岡市中央公民館","盛岡市愛宕町14-1","盛岡市中央公民館","019-654-5366","019-653-3505","chuo.ph@city.morioka.iwate.jp","http://www.city.morioka.iwate.jp/kurashi/kokyoshisetsu/kominkan/chuo/index.html",null,null,null,null,null,null,"川井村",null,"スポーツ・健康 - スキー・スケート"]
[28,"継続","市町村向け","公民館ってこんなところ「公民館の仲間たち」","教養・文化 - その他","盛岡市","ラウンジスペースを活用して，中央公民館登録社会教育関係団体の活動風景を示す写真展示を行い，サークル活動に関心を持ってもらう場を設け，サークルの会員増を支援する機会を設ける。",null,2021,4,null,2022,3,null,null,"無料",null,"盛岡市中央公民館","盛岡市愛宕町14-1","盛岡市中央公民館","019-654-5366","019-653-3505","chuo.ph@city.morioka.iwate.jp","http://www.city.morioka.iwate.jp/kurashi/kokyoshisetsu/kominkan/chuo/index.html",null,null,null,null,null,null,"久慈市",null,"スポーツ・健康 - 健康・予防"]
[29,"継続","市町村向け","不来方大学院","教養・文化 - その他","盛岡市","現代社会の理解と豊かな老後を築くために，高齢者が相集い，学習活動やクラブ活動を通して相互の親睦を深める。【SDGs目標３】",null,2021,5,null,2021,11,null,null,"有料","自治会費4,500円","盛岡市中央公民館","盛岡市愛宕町14-1","盛岡市中央公民館","019-654-5366","019-653-3505","chuo.ph@city.morioka.iwate.jp","http://www.city.morioka.iwate.jp/kurashi/kokyoshisetsu/kominkan/chuo/index.html",null,null,null,null,null,null,"普代村",null,"スポーツ・健康 - 登山・野外活動"]
[30,"継続","市町村向け","月釜茶会","教養・文化 - 料理・お茶・お花・書道","盛岡市","茶道協会と共催で茶会を開催し，広く市民に茶道と接する機会を提供する。",null,2021,7,null,2022,3,null,null,"有料","当日券1,000円","盛岡市中央公民館","盛岡市愛宕町14-1","盛岡市中央公民館","019-654-5366","019-653-3505","chuo.ph@city.morioka.iwate.jp","http://www.city.morioka.iwate.jp/kurashi/kokyoshisetsu/kominkan/chuo/index.html","5，6月分中止",null,null,null,null,null,"洋野町",null,"スポーツ・健康 - レクリエーション"]
[31,"継続","市町村向け","茶道にチャレンジ！","教養・文化 - 料理・お茶・お花・書道","盛岡市","公民館で行われているお茶会で盛岡茶道五流派を体験し，茶道の心得を学ぶ。",null,2021,7,null,2021,11,null,null,"有料","1,000円","盛岡市中央公民館","盛岡市愛宕町14-1","盛岡市中央公民館","019-654-5366","019-653-3505","chuo.ph@city.morioka.iwate.jp","http://www.city.morioka.iwate.jp/kurashi/kokyoshisetsu/kominkan/chuo/index.html","5，6月分中止",null,null,null,null,null,"野田村",null,"スポーツ・健康 - その他"]
[32,"新規","市町村向け","はじめての絵画教室　","教養・文化 - 美術・工芸","盛岡市","絵を描きたいが，なかなか上手くいかないで躊躇している人たちに，一歩を踏み出すためのコツを教える。",null,2021,8,null,2021,9,null,null,"有料","1,000円","盛岡市中央公民館","盛岡市愛宕町14-1","盛岡市中央公民館","019-654-5366","019-653-3505","chuo.ph@city.morioka.iwate.jp","http://www.city.morioka.iwate.jp/kurashi/kokyoshisetsu/kominkan/chuo/index.html",null,null,null,null,null,null,"二戸市",null,"ビジネスライフ - 経営管理"]
[33,"新規","市町村向け","中央公民館アートフェスタ","教養・文化 - 美術・工芸","盛岡市","企画展示室の供用可能となる機会に，庭園を有する稀有な公民館としての立地条件を生かした屋内外の環境を活用する展示会を開催する。",null,2021,11,null,2021,11,null,null,"無料",null,"盛岡市中央公民館","盛岡市愛宕町14-1","盛岡市中央公民館","019-654-5366","019-653-3505","chuo.ph@city.morioka.iwate.jp","http://www.city.morioka.iwate.jp/kurashi/kokyoshisetsu/kominkan/chuo/index.html",null,null,null,null,null,null,"軽米町",null,"ビジネスライフ - 土木・建築"]
[34,"新規","市町村向け","市民企画講座","教養・文化 - その他","盛岡市","市民の視点で市民及び団体が企画提案を募り事業・講座を実施する。",null,2021,12,null,2021,12,null,null,"有料","500円","盛岡市中央公民館","盛岡市愛宕町14-1","盛岡市中央公民館","019-654-5366","019-653-3505","chuo.ph@city.morioka.iwate.jp","http://www.city.morioka.iwate.jp/kurashi/kokyoshisetsu/kominkan/chuo/index.html",null,null,null,null,null,null,"九戸村",null,"ビジネスライフ - 機械・電気・工学"]
[35,"継続","市町村向け","公開講座","教養・文化 - その他","盛岡市","地域社会における生涯学習を推進するため，家庭教育・社会教育学級及び一般市民を対象に，誰でも参加できる公開講座を開催する。",null,2021,7,null,2021,9,null,null,"無料",null,"盛岡市中央公民館","盛岡市愛宕町14-1","盛岡市中央公民館","019-654-5366","019-653-3505","chuo.ph@city.morioka.iwate.jp","http://www.city.morioka.iwate.jp/kurashi/kokyoshisetsu/kominkan/chuo/index.html",null,null,null,null,null,null,"一戸町",null,"ビジネスライフ - ISO・知的財産"]
[36,"新規","市町村向け","読み聞かせボランティア講座","現代的課題 - ＮＰＯ・ボランティア","盛岡市","読書普及活動の広がりを支援するために，ボランティア育成を図る。",null,2021,9,null,2021,9,null,null,"無料",null,"盛岡市中央公民館","盛岡市愛宕町14-1","盛岡市中央公民館","019-654-5366","019-653-3505","chuo.ph@city.morioka.iwate.jp","http://www.city.morioka.iwate.jp/kurashi/kokyoshisetsu/kominkan/chuo/index.html",null,null,null,null,null,null,null,null,"ビジネスライフ - 農林水産"]
[37,"継続","市町村向け","作って，遊んで，子育てしよう！","現代的課題 - 子育て・家庭教育","盛岡市","身近にある材料を用いたおもちゃ作りをとおして，手作りおもちゃの楽しさを親子で味わうとともに，子育てについて学び合う。",null,2021,5,null,2021,5,null,null,"無料",null,"盛岡市中央公民館太田分館","盛岡市中太田深持9","盛岡市中央公民館太田分館","019-658-1330",null,null,null,null,null,null,null,null,null,null,null,"ビジネスライフ - 産業振興"]
[38,"継続","市町村向け","親子でクリスマス会を楽しもう！","現代的課題 - 子育て・家庭教育","盛岡市","クリスマス会や親子のふれあい遊びをとおして，子育てについての悩みや不安などを語り合う。 ",null,2021,12,null,2021,12,null,null,"無料",null,"盛岡市中央公民館太田分館","盛岡市中太田深持9","盛岡市中央公民館太田分館","019-658-1330",null,null,null,null,null,null,null,null,null,null,null,"ビジネスライフ - その他"]
[39,"継続","市町村向け","曲り家で昔話と読み聞かせを楽しもう！","現代的課題 - 子育て・家庭教育","盛岡市","曲り家で古の人々の暮らしに触れながら，郷土に伝わる昔話や絵本の読み聞かせを楽しむ。",null,2021,8,null,2021,8,null,null,"無料",null,"盛岡市中央公民館太田分館","盛岡市中太田深持9","盛岡市中央公民館太田分館","019-658-1330",null,null,null,null,null,null,null,null,null,null,null,"パソコン - パソコン"]
[40,"継続","市町村向け","夏休み工作教室\n「スノードームを作ってみよう！」","教養・文化 - 美術・工芸","盛岡市","スノードーム作りをとおして，豊かな創造性や感性を育むとともに，夏休み作品作りを楽しむ。",null,2021,8,null,2021,8,null,null,"無料",null,"盛岡市中央公民館太田分館","盛岡市中太田深持9","盛岡市中央公民館太田分館","019-658-1330"]
[41,"継続","市町村向け","ランニング教室","スポーツ・健康 - マラソン・陸上","盛岡市","中・高校生やランニング愛好者が，走りの基本を身につけるとともに，走ることの面白さや心地よさを楽しむ。",null,2021,7,null,2021,1,null,null,"無料",null,"盛岡市中央公民館太田分館","盛岡市中太田深持9","盛岡市中央公民館太田分館","019-658-1330"]
[42,"継続","市町村向け","マラソン教室出前授業","スポーツ・健康 - マラソン・陸上","盛岡市","小学校の校内マラソン大会に向けて，コースの試走や走り方，目標の持ち方などを学習する。",null,2021,9,null,2021,9,null,null,"無料",null,"盛岡市中央公民館太田分館","盛岡市中太田深持9","盛岡市中央公民館太田分館","019-658-1330"]
[43,"継続","市町村向け","まちなかたんけん出前授業","教養・文化 - その他","盛岡市","「まちなかたんけん」の授業を曲り家(太田民俗資料館)で行う。身近にある施設を探検することで，地域への関心や愛着心を育む。",null,2021,11,null,2021,11,null,null,"無料",null,"盛岡市中央公民館太田分館","盛岡市中太田深持9","盛岡市中央公民館太田分館","019-658-1330"]
[44,"継続","市町村向け","冬休み工作教室「パステルアートを楽しもう！」","教養・文化 - 美術・工芸","盛岡市","パステルアートの魅力にふれ，作品作りを楽しむ。",null,2022,1,null,2022,1,null,null,"無料",null,"盛岡市中央公民館太田分館","盛岡市中太田深持9","盛岡市中央公民館太田分館","019-658-1330"]
[45,"継続","市町村向け","スキー教室出前授業","スポーツ・健康 - スキー・スケート","盛岡市","小学校スキー教室において，スキー技能の向上とスキーの楽しさを学ぶ。",null,2022,2,null,2022,2,null,null,"無料",null,"盛岡市中央公民館太田分館","盛岡市中太田深持9","盛岡市中央公民館太田分館","019-658-1330"]
[46,"継続","市町村向け","太田の歴史を学ぼう","学術一般 - 歴史・地理・民俗","盛岡市","曲り家（太田民俗資料館）の整備・移築の経緯や歴史的価値，構造，生活様式の違いなどを学ぶ。",null,2022,2,null,2022,2,null,null,"無料",null,"盛岡市中央公民館太田分館","盛岡市中太田深持9","盛岡市中央公民館太田分館","019-658-1330"]
[47,"継続","市町村向け","太田東小学校八ツ口神楽引継式","学術一般 - 歴史・地理・民俗","盛岡市","卒業する６年生から５年生へ，八ツ口神楽の引継を行う。郷土芸能の持つ魅力や文化を継承することの大切さを学ぶ。",null,2022,2,null,2022,2,null,null,"無料",null,"盛岡市中央公民館太田分館","盛岡市中太田深持9","盛岡市中央公民館太田分館","019-658-1330"]
[48,"新規","市町村向け","やさしい和菓子作り体験","教養・文化 - 料理・お茶・お花・書道","盛岡市","餅菓子・大福・だんご・おはぎなど日本伝統の和菓子を自分の手で作りながら，さまざまな技術や知識を学ぶ。",null,2021,6,null,2021,6,null,null,"無料",null,"盛岡市中央公民館太田分館","盛岡市中太田深持9","盛岡市中央公民館太田分館","019-658-1330"]
[49,"継続","市町村向け","手芸教室「干支のミニ羽子板づ作り」","教養・文化 - 美術・工芸","盛岡市","干支のミニ羽子板作りをとおして，手芸の基礎と応用を学ぶ。",null,2021,11,null,2021,11,null,null,"無料",null,"盛岡市中央公民館太田分館","盛岡市中太田深持9","盛岡市中央公民館太田分館","019-658-1330"]
[50,"継続","市町村向け","講演会「私の人生を語る会」","教養・文化 - その他","盛岡市","地域で活躍する方から，その生き方や考え方，体験などを学ぶ。",null,2022,2,null,2022,2,null,null,"無料",null,"盛岡市中央公民館太田分館","盛岡市中太田深持9","盛岡市中央公民館太田分館","019-658-1330"]
[51,"継続","市町村向け","グランドゴルフ教室","スポーツ・健康 - レクリエーション","盛岡市","気軽に楽しめるグランドゴルフをとおして，運動の楽しさや喜びを体感する。",null,2021,10,null,2021,10,null,null,"無料",null,"盛岡市中央公民館太田分館","盛岡市中太田深持9","盛岡市中央公民館太田分館","019-658-1330"]
[52,"継続","市町村向け","ニュースポーツ教室","スポーツ・健康 - レクリエーション","盛岡市","気軽に楽しめるニュースポーツをとおして，運動の楽しさや喜びを体感する。",null,2022,2,null,2022,2,null,null,"無料",null,"盛岡市中央公民館太田分館","盛岡市中太田深持9","盛岡市中央公民館太田分館","019-658-1330"]
[53,"継続","市町村向け","八ツ口神楽継承活動","教養・文化 - 郷土芸能","盛岡市","太田地区に伝わる郷土芸能(八ツ口神楽)を継承・保存するために，後継者の育成活動を支援する。",null,2021,8,null,2021,8,null,null,"無料",null,"盛岡市中央公民館太田分館","盛岡市中太田深持9","盛岡市中央公民館太田分館","019-658-1330"]
[54,"継続","市町村向け","上鹿妻念仏剣舞継承活動","教養・文化 - 郷土芸能","盛岡市","太田地区に伝わる郷土芸能(上鹿妻念仏剣舞)を継承・保存するために，後継者の育成活動を支援する。",null,2021,8,null,2021,8,null,null,"無料",null,"盛岡市中央公民館太田分館","盛岡市中太田深持9","盛岡市中央公民館太田分館","019-658-1330"]
[55,"継続","市町村向け","上鹿妻田植踊り継承活動","教養・文化 - 郷土芸能","盛岡市","太田地区に伝わる郷土芸能(上鹿妻田植踊り)を継承・保存するために，後継者の育成活動を支援する。",null,2021,8,null,2021,8,null,null,"無料",null,"盛岡市中央公民館太田分館","盛岡市中太田深持9","盛岡市中央公民館太田分館","019-658-1330"]
[56,"継続","市町村向け","小正月行事のつどい","教養・文化 - 郷土芸能","盛岡市","太田地区に伝わる小正月行事を曲り家で再現し，昔の生活の様子とその由来を学ぶとともに，子どもから高齢者まで世代を超えた交流をする。",null,2022,1,null,2022,1,null,null,"無料",null,"盛岡市中央公民館太田分館","盛岡市中太田深持9","盛岡市中央公民館太田分館","019-658-1330"]
[57,"継続","市町村向け","親子ふれあい事業「影絵をみよう」","現代的課題 - 子育て・家庭教育","盛岡市","親子での影絵鑑賞の機会を提供することにより、子の情操豊かな成長を育む機会とし、心豊かな子育ての一助とします。",null,2021,9,18,2021,9,18,"50人","無料",null,"盛岡劇場タウンホール","盛岡市松尾町3-1","盛岡市河南公民館","019-622-2258","019-622-1910","kanan@mfca.jp","https://www.mfca.jp/morigeki/workshop"]
[58,"継続","市町村向け","コラボ事業vol.2　しらたき×かなん×こども「つくってそっちこっちおくよ！」","現代的課題 - 高齢化・介護・福祉","盛岡市","盛岡劇場内に、しらたき工房で制作したグッズ、工房の様子や作者のコメント等を掲示し、活動への理解を深める機会をつくります。また、夏休み期間を利用して親子工作体験を実施します。\n展示／通年　工作体験／7月29日",null,2021,4,null,2022,3,null,"工作8組16人","展示は無料、工作は有料","材料費・保険料700円","盛岡市河南公民館","盛岡市松尾町3-1","盛岡市河南公民館","019-622-2258","019-622-1910","kanan@mfca.jp","https://www.mfca.jp/morigeki/workshop"]
[59,"継続","市町村向け","少年自然教室","現代的課題 - 子育て・家庭教育","盛岡市","自然の中での体験的な活動をとおして自然保護への関心を高め、動植物に対する愛護の心を育てることを目的とします。また、異学校異学年の参加者相互のふれあいを深める機会とし、青少年の健全育成に寄与します。",null,2021,6,19,2022,1,29,"15人","有料","材料費・保険料5,000円","盛岡市立区界高原少年自然の家ほか","宮古市区界2-111\nほか","盛岡市河南公民館","019-622-2258","019-622-1910","kanan@mfca.jp","https://www.mfca.jp/morigeki/workshop"]
{"$rows_left_out":582}
{"sheet":"個別データ","index":2,"n_rows":17,"n_cols":16,"rows_kept":17,"cut":false,"hidden":false,"merged":[[10,3,10,15],[15,3,15,15],[16,3,16,15],[11,3,11,15],[12,3,12,15],[13,3,13,15],[14,3,14,15],[2,9,2,15],[9,3,9,6],[9,7,9,15],[3,1,3,2],[2,1,2,2],[2,3,2,5],[2,6,2,8],[4,1,4,2],[3,3,3,15],[4,3,4,15],[5,1,5,2],[8,1,8,2],[6,3,6,15],[7,3,7,15],[8,3,8,15],[15,1,15,2],[16,1,16,2],[11,1,14,1],[6,1,7,1],[9,1,9,2],[10,1,10,2]]}
[]
[]
[null,"項番",null,1,null,null,"分類",null,null,{"$f":"VLOOKUP($D$3,'2021講座イベント情報'!$A$2:$Y$4070,5,0)","v":"現代的課題 - 子育て・家庭教育"}]
[null,"事業名",null,{"$f":"VLOOKUP($D$3,'2021講座イベント情報'!$A$2:$Y$4070,4,0)","v":"図書バッグ作り講座"}]
[null,"内容",null,{"$f":"VLOOKUP($D$3,'2021講座イベント情報'!$A$2:$Y$4070,7,0)","v":"児童保護者を対象とした，図書室利用の際に役立つエコバッグを児童書のデザインを参考にしながら制作。"}]
[null,"開催日",null,{"$f":"VLOOKUP($D$3,'2021講座イベント情報'!$A$2:$Y$4070,9,0)","v":2022},"年",{"$f":"VLOOKUP($D$3,'2021講座イベント情報'!$A$2:$Y$4070,10,0)","v":3},"月",{"$f":"VLOOKUP($D$3,'2021講座イベント情報'!$A$2:$Y$4070,11,0)","v":0},"日","～",{"$f":"VLOOKUP($D$3,'2021講座イベント情報'!$A$2:$Y$4070,12,0)","v":2022},"年",{"$f":"VLOOKUP($D$3,'2021講座イベント情報'!$A$2:$Y$4070,13,0)","v":3},"月",{"$f":"VLOOKUP($D$3,'2021講座イベント情報'!$A$2:$Y$4070,14,0)","v":0},"日"]
[null,"開催場所","名称",{"$f":"VLOOKUP($D$3,'2021講座イベント情報'!$A$2:$Y$4070,18,0)","v":"盛岡市中央公民館"}]
[null,null,"住所",{"$f":"VLOOKUP($D$3,'2021講座イベント情報'!$A$2:$Y$4070,19,0)","v":"盛岡市愛宕町14-1"}]
[null,"県民向け・市町村向け",null,{"$f":"VLOOKUP($D$3,'2021講座イベント情報'!$A$2:$Y$4070,3,0)","v":"市町村向け"}]
[null,"費用",null,{"$f":"VLOOKUP($D$3,'2021講座イベント情報'!$A$2:$Y$4070,16,0)","v":"無料"},null,null,null,{"$f":"VLOOKUP($D$3,'2021講座イベント情報'!$A$2:$Y$4070,17,0)","v":0}]
[null,"定員",null,{"$f":"VLOOKUP($D$3,'2021講座イベント情報'!$A$2:$Y$4070,15,0)","v":0}]
[null,"問い合わせ先","名称",{"$f":"VLOOKUP($D$3,'2021講座イベント情報'!$A$2:$Y$4070,20,0)","v":"盛岡市中央公民館"}]
[null,null,"電話番号",{"$f":"VLOOKUP($D$3,'2021講座イベント情報'!$A$2:$Y$4070,21,0)","v":"019-654-5366"}]
[null,null,"ＦＡＸ番号",{"$f":"VLOOKUP($D$3,'2021講座イベント情報'!$A$2:$Y$4070,22,0)","v":"019-653-3505"}]
[null,null,"Ｅ-ＭＡＩＬ",{"$f":"VLOOKUP($D$3,'2021講座イベント情報'!$A$2:$Y$4070,23,0)","v":"chuo.ph@city.morioka.iwate.jp"}]
[null,"備考",null,{"$f":"VLOOKUP($D$3,'2021講座イベント情報'!$A$2:$Y$4070,25,0)","v":"先着順"}]
[null,"関連サイトＵＲＬ",null,{"$f":"VLOOKUP($D$3,'2021講座イベント情報'!$A$2:$Y$4070,24,0)","v":"http://www.city.morioka.iwate.jp/kurashi/kokyoshisetsu/kominkan/chuo/index.html"}]

{"sheet":"選択リスト","index":3,"n_rows":40,"n_cols":7,"rows_kept":40,"cut":false,"hidden":false,"merged":[[1,0,1,1],[2,0,3,0],[2,3,36,3],[8,0,10,0],[12,0,17,0],[19,0,21,0],[5,0,6,0]]}
[]
["【選択用リスト】"]
["該当あり",null,null,"開催場所\n市町村","盛岡市",null,"現代的課題 - 子育て・家庭教育"]
[null,"○",null,null,"雫石町",null,"現代的課題 - 環境・自然保護"]
[null,null,null,null,"葛巻町",null,"現代的課題 - 男女共同参画"]
["更新種別","新規",null,null,"岩手町",null,"現代的課題 - 高齢化・介護・福祉"]
[null,"継続",null,null,"八幡平市",null,"現代的課題 - ＮＰＯ・ボランティア"]
[null,null,null,null,"滝沢市",null,"現代的課題 - まちづくり"]
["県民・市町村向け","県民向け",null,null,"紫波町",null,"現代的課題 - 語学・国際理解"]
[null,"市町村向け",null,null,"矢巾町",null,"学術一般 - 歴史・地理・民俗"]
[null,"広域",null,null,"花巻市",null,"学術一般 - 心理・哲学・法律"]
[null,null,null,null,"北上市",null,"学術一般 - 教育"]
[null,null,null,null,"西和賀町",null,"学術一般 - 物理・天文・地学"]
[null,null,null,null,"奥州市",null,"学術一般 - 自然・動植物"]
[null,null,null,null,"金ヶ崎町",null,"学術一般 - 医学・薬学"]
[null,null,null,null,"平泉町",null,"学術一般 - その他"]
[null,null,null,null,"一関市",null,"教養・文化 - 美術・工芸"]
[null,null,null,null,"大船渡市",null,"教養・文化 - 音楽"]
[null,null,null,null,"陸前高田市",null,"教養・文化 - 文学"]
[null,null,null,null,"住田町",null,"教養・文化 - 舞踏・演劇"]
[null,null,null,null,"遠野市",null,"教養・文化 - 郷土芸能"]
[null,null,null,null,"釜石市",null,"教養・文化 - 料理・お茶・お花・書道"]
[null,null,null,null,"大槌町",null,"教養・文化 - その他"]
[null,null,null,null,"宮古市",null,"スポーツ・健康 - マラソン・陸上"]
[null,null,null,null,"山田町",null,"スポーツ・健康 - 球技"]
[null,null,null,null,"岩泉町",null,"スポーツ・健康 - 武道"]
[null,null,null,null,"田野畑村",null,"スポーツ・健康 - 水泳"]
[null,null,null,null,"川井村",null,"スポーツ・健康 - スキー・スケート"]
[null,null,null,null,"久慈市",null,"スポーツ・健康 - 健康・予防"]
[null,null,null,null,"普代村",null,"スポーツ・健康 - 登山・野外活動"]
[null,null,null,null,"洋野町",null,"スポーツ・健康 - レクリエーション"]
[null,null,null,null,"野田村",null,"スポーツ・健康 - その他"]
[null,null,null,null,"二戸市",null,"ビジネスライフ - 経営管理"]
[null,null,null,null,"軽米町",null,"ビジネスライフ - 土木・建築"]
[null,null,null,null,"九戸村",null,"ビジネスライフ - 機械・電気・工学"]
[null,null,null,null,"一戸町",null,"ビジネスライフ - ISO・知的財産"]
[null,null,null,null,null,null,"ビジネスライフ - 農林水産"]
[null,null,null,null,null,null,"ビジネスライフ - 産業振興"]
[null,null,null,null,null,null,"ビジネスライフ - その他"]
[null,null,null,null,null,null,"パソコン - パソコン"]